Fourseven:scss meteor 1.4 error cant install mac ox


#1

While loading package fourseven:scss@3.8.0_1: error: Command failed: /Users/ralphevano/.meteor/packages/meteor-tool/.1.4.0.hl4wt2++os.osx.x86_64+web.browser+web.cordova/mt-os.osx.x86_64/dev_bundle/bin/npm rebuild --no-bin-links --update-binary { [Error: EACCES: permission denied, mkdir '/Users/ralphevano/.meteor/packages/fourseven_scss/.3.8.0_1.18rqyk3++os.osx.x86_64+web.browser+web.cordova/plugin.compileScssBatch.os.osx.x86_64/npm/node_modules/meteor/compileScssBatch/node_modules/.temp-on4ztm/node_modules/node-sass/vendor/darwin-x64-46'] errno: -13, code: 'EACCES', syscall: 'mkdir', path: '/Users/ralphevano/.meteor/packages/fourseven_scss/.3.8.0_1.18rqyk3++os.osx.x86_64+web.browser+web.cordova/plugin.compileScssBatch.os.osx.x86_64/npm/node_modules/meteor/compileScssBatch/node_modules/.temp-on4ztm/node_modules/node-sass/vendor/darwin-x64-46' } gyp info it worked if it ends with ok gyp verb cli [ '/Users/ralphevano/.meteor/packages/meteor-tool/.1.4.0.hl4wt2++os.osx.x86_64+web.browser+web.cordova/mt-os.osx.x86_64/dev_bundle/bin/node', gyp verb cli '/Users/ralphevano/.meteor/packages/fourseven_scss/.3.8.0_1.18rqyk3++os.osx.x86_64+web.browser+web.cordova/plugin.compileScssBatch.os.osx.x86_64/npm/node_modules/meteor/compileScssBatch/node_modules/node-gyp/bin/node-gyp.js', gyp verb cli 'rebuild', gyp verb cli '--verbose', gyp verb cli '--libsass_ext=', gyp verb cli '--libsass_cflags=', gyp verb cli '--libsass_ldflags=', gyp verb cli '--libsass_library=' ] gyp info using node-gyp@3.3.1 gyp info using node@4.4.7 | darwin | x64 gyp verb command rebuild [] gyp verb command clean [] gyp verb clean removing "build" directory gyp verb command configure [] gyp verb check python checking for Python executable "python2" in the PATH gyp verbwhichfailed Error: not found: python2 gyp verbwhichfailed at getNotFoundError (/Users/ralphevano/.meteor/packages/fourseven_scss/.3.8.0_1.18rqyk3++os.osx.x86_64+web.browser+web.cordova/plugin.compileScssBatch.os.osx.x86_64/npm/node_modules/meteor/compileScssBatch/node_modules/which/which.js:14:12) gyp verbwhichfailed at F (/Users/ralphevano/.meteor/packages/fourseven_scss/.3.8.0_1.18rqyk3++os.osx.x86_64+web.browser+web.cordova/plugin.compileScssBatch.os.osx.x86_64/npm/node_modules/meteor/compileScssBatch/node_modules/which/which.js:69:19) gyp verbwhichfailed at E (/Users/ralphevano/.meteor/packages/fourseven_scss/.3.8.0_1.18rqyk3++os.osx.x86_64+web.browser+web.cordova/plugin.compileScssBatch.os.osx.x86_64/npm/node_modules/meteor/compileScssBatch/node_modules/which/which.js:81:29) gyp verbwhichfailed at /Users/ralphevano/.meteor/packages/fourseven_scss/.3.8.0_1.18rqyk3++os.osx.x86_64+web.browser+web.cordova/plugin.compileScssBatch.os.osx.x86_64/npm/node_modules/meteor/compileScssBatch/node_modules/which/which.js:90:16 gyp verbwhichfailed at /Users/ralphevano/.meteor/packages/fourseven_scss/.3.8.0_1.18rqyk3++os.osx.x86_64+web.browser+web.cordova/plugin.compileScssBatch.os.osx.x86_64/npm/node_modules/meteor/compileScssBatch/node_modules/isexe/index.js:44:5 gyp verbwhichfailed at /Users/ralphevano/.meteor/packages/fourseven_scss/.3.8.0_1.18rqyk3++os.osx.x86_64+web.browser+web.cordova/plugin.compileScssBatch.os.osx.x86_64/npm/node_modules/meteor/compileScssBatch/node_modules/isexe/access.js:8:5 gyp verbwhichfailed at FSReqWrap.oncomplete (fs.js:82:15) gyp verbwhichfailed python2 { [Error: not found: python2] code: 'ENOENT' } gyp verb check python checking for Python executable "python" in the PATH gyp verbwhichsucceeded python /usr/bin/python gyp verb check python version/usr/bin/python -c “import platform; print(platform.python_version());”` returned: "2.7.10\n"
gyp verb get node dir no --target version specified, falling back to host node version: 4.4.7
gyp verb command install [ ‘4.4.7’ ]
gyp verb install input version string “4.4.7"
gyp verb install installing version: 4.4.7
gyp verb install --ensure was passed, so won’t reinstall if already installed
gyp verb install version is already installed, need to check “installVersion"
gyp verb got “installVersion” 9
gyp verb needs “installVersion” 9
gyp verb install version is good
gyp verb get node dir target node version installed: 4.4.7
gyp verb build dir attempting to create “build” dir:
/Users/ralphevano/.meteor/packages/fourseven_scss/.3.8.0_1.18rqyk3++os.osx.x86_64+web.browser+web.cordova/plugin.compileScssBatch.os.osx.x86_64/npm/node_modules/meteor/compileScssBatch/node_modules/.temp-on4ztm/node_modules/node-sass/build
gyp ERR! configure error
gyp ERR! stack Error: EACCES: permission denied, mkdir
’/Users/ralphevano/.meteor/packages/fourseven_scss/.3.8.0_1.18rqyk3++os.osx.x86_64+web.browser+web.cordova/plugin.compileScssBatch.os.osx.x86_64/npm/node_modules/meteor/compileScssBatch/node_modules/.temp-on4ztm/node_modules/node-sass/build’
gyp ERR! stack at Error (native)
gyp ERR! System Darwin 15.6.0
gyp ERR! command “/Users/ralphevano/.meteor/packages/meteor-tool/.1.4.0.hl4wt2++os.osx.x86_64+web.browser+web.cordova/mt-os.osx.x86_64/dev_bundle/bin/node”
”/Users/ralphevano/.meteor/packages/fourseven_scss/.3.8.0_1.18rqyk3++os.osx.x86_64+web.browser+web.cordova/plugin.compileScssBatch.os.osx.x86_64/npm/node_modules/meteor/compileScssBatch/node_modules/node-gyp/bin/node-gyp.js”
“rebuild” “–verbose” “–libsass_ext=” “–libsass_cflags=” “–libsass_ldflags=” "–libsass_library="
gyp ERR! cwd
/Users/ralphevano/.meteor/packages/fourseven_scss/.3.8.0_1.18rqyk3++os.osx.x86_64+web.browser+web.cordova/plugin.compileScssBatch.os.osx.x86_64/npm/node_modules/meteor/compileScssBatch/node_modules/.temp-on4ztm/node_modules/node-sass
gyp ERR! node -v v4.4.7
gyp ERR! node-gyp -v v3.3.1
gyp ERR! not ok
Build failed

npm ERR! Darwin 15.6.0
npm ERR! argv “/Users/ralphevano/.meteor/packages/meteor-tool/.1.4.0.hl4wt2++os.osx.x86_64+web.browser+web.cordova/mt-os.osx.x86_64/dev_bundle/bin/node”
"/Users/ralphevano/.meteor/packages/meteor-tool/.1.4.0.hl4wt2++os.osx.x86_64+web.browser+web.cordova/mt-os.osx.x86_64/dev_bundle/bin/npm" “rebuild” “–no-bin-links”
"–update-binary"
npm ERR! node v4.4.7
npm ERR! npm v3.10.5
npm ERR! code ELIFECYCLE
npm ERR! node-sass@3.8.0 postinstall: node scripts/build.js
npm ERR! Exit status 1
npm ERR!
npm ERR! Failed at the node-sass@3.8.0 postinstall script ‘node scripts/build.js’.
npm ERR! Make sure you have the latest version of node.js and npm installed.
npm ERR! If you do, this is most likely a problem with the node-sass package,
npm ERR! not with npm itself.
npm ERR! Tell the author that this fails on your system:
npm ERR! node scripts/build.js
npm ERR! You can get information on how to open an issue for this project with:
npm ERR! npm bugs node-sass
npm ERR! Or if that isn’t available, you can get their info via:
npm ERR! npm owner ls node-sass
npm ERR! There is likely additional logging output above.

npm ERR! Please include the following file with any support request:
npm ERR!
/Users/ralphevano/.meteor/packages/fourseven_scss/.3.8.0_1.18rqyk3++os.osx.x86_64+web.browser+web.cordova/plugin.compileScssBatch.os.osx.x86_64/npm/node_modules/meteor/compileScssBatch/node_modules/.temp-on4ztm/npm-debug.log
{ [Error: EACCES: permission denied, mkdir
’/Users/ralphevano/.meteor/packages/fourseven_scss/.3.8.0_1.18rqyk3++os.osx.x86_64+web.browser+web.cordova/plugin.compileScssBatch.os.osx.x86_64/npm/node_modules/meteor/compileScssBatch/node_modules/.temp-on4ztm/node_modules/node-sass/vendor/darwin-x64-46’]
errno: -13,
code: ‘EACCES’,
syscall: ‘mkdir’,
path:
’/Users/ralphevano/.meteor/packages/fourseven_scss/.3.8.0_1.18rqyk3++os.osx.x86_64+web.browser+web.cordova/plugin.compileScssBatch.os.osx.x86_64/npm/node_modules/meteor/compileScssBatch/node_modules/.temp-on4ztm/node_modules/node-sass/vendor/darwin-x64-46’
}
gyp info it worked if it ends with ok
gyp verb cli [ ‘/Users/ralphevano/.meteor/packages/meteor-tool/.1.4.0.hl4wt2++os.osx.x86_64+web.browser+web.cordova/mt-os.osx.x86_64/dev_bundle/bin/node’,
gyp verb cli
’/Users/ralphevano/.meteor/packages/fourseven_scss/.3.8.0_1.18rqyk3++os.osx.x86_64+web.browser+web.cordova/plugin.compileScssBatch.os.osx.x86_64/npm/node_modules/meteor/compileScssBatch/node_modules/node-gyp/bin/node-gyp.js’,
gyp verb cli ‘rebuild’,
gyp verb cli ‘–verbose’,
gyp verb cli ‘–libsass_ext=’,
gyp verb cli ‘–libsass_cflags=’,
gyp verb cli ‘–libsass_ldflags=’,
gyp verb cli ‘–libsass_library=’ ]
gyp info using node-gyp@3.3.1
gyp info using node@4.4.7 | darwin | x64
gyp verb command rebuild []
gyp verb command clean []
gyp verb clean removing “build” directory
gyp verb command configure []
gyp verb check python checking for Python executable “python2” in the PATH
gyp verb which failed Error: not found: python2
gyp verb which failed at getNotFoundError
(/Users/ralphevano/.meteor/packages/fourseven_scss/.3.8.0_1.18rqyk3++os.osx.x86_64+web.browser+web.cordova/plugin.compileScssBatch.os.osx.x86_64/npm/node_modules/meteor/compileScssBatch/node_modules/which/which.js:14:12)
gyp verb which failed at F
(/Users/ralphevano/.meteor/packages/fourseven_scss/.3.8.0_1.18rqyk3++os.osx.x86_64+web.browser+web.cordova/plugin.compileScssBatch.os.osx.x86_64/npm/node_modules/meteor/compileScssBatch/node_modules/which/which.js:69:19)
gyp verb which failed at E
(/Users/ralphevano/.meteor/packages/fourseven_scss/.3.8.0_1.18rqyk3++os.osx.x86_64+web.browser+web.cordova/plugin.compileScssBatch.os.osx.x86_64/npm/node_modules/meteor/compileScssBatch/node_modules/which/which.js:81:29)
gyp verb which failed at
/Users/ralphevano/.meteor/packages/fourseven_scss/.3.8.0_1.18rqyk3++os.osx.x86_64+web.browser+web.cordova/plugin.compileScssBatch.os.osx.x86_64/npm/node_modules/meteor/compileScssBatch/node_modules/which/which.js:90:16
gyp verb which failed at
/Users/ralphevano/.meteor/packages/fourseven_scss/.3.8.0_1.18rqyk3++os.osx.x86_64+web.browser+web.cordova/plugin.compileScssBatch.os.osx.x86_64/npm/node_modules/meteor/compileScssBatch/node_modules/isexe/index.js:44:5
gyp verb which failed at
/Users/ralphevano/.meteor/packages/fourseven_scss/.3.8.0_1.18rqyk3++os.osx.x86_64+web.browser+web.cordova/plugin.compileScssBatch.os.osx.x86_64/npm/node_modules/meteor/compileScssBatch/node_modules/isexe/access.js:8:5
gyp verb which failed at FSReqWrap.oncomplete (fs.js:82:15)
gyp verb which failed python2 { [Error: not found: python2] code: ‘ENOENT’ }
gyp verb check python checking for Python executable “python” in the PATH
gyp verb which succeeded python /usr/bin/python
gyp verb check python version /usr/bin/python -c "import platform; print(platform.python_version());" returned: "2.7.10\n"
gyp verb get node dir no --target version specified, falling back to host node version: 4.4.7
gyp verb command install [ ‘4.4.7’ ]
gyp verb install input version string “4.4.7"
gyp verb install installing version: 4.4.7
gyp verb install --ensure was passed, so won’t reinstall if already installed
gyp verb install version is already installed, need to check “installVersion"
gyp verb got “installVersion” 9
gyp verb needs “installVersion” 9
gyp verb install version is good
gyp verb get node dir target node version installed: 4.4.7
gyp verb build dir attempting to create “build” dir:
/Users/ralphevano/.meteor/packages/fourseven_scss/.3.8.0_1.18rqyk3++os.osx.x86_64+web.browser+web.cordova/plugin.compileScssBatch.os.osx.x86_64/npm/node_modules/meteor/compileScssBatch/node_modules/.temp-on4ztm/node_modules/node-sass/build
gyp ERR! configure error
gyp ERR! stack Error: EACCES: permission denied, mkdir
’/Users/ralphevano/.meteor/packages/fourseven_scss/.3.8.0_1.18rqyk3++os.osx.x86_64+web.browser+web.cordova/plugin.compileScssBatch.os.osx.x86_64/npm/node_modules/meteor/compileScssBatch/node_modules/.temp-on4ztm/node_modules/node-sass/build’
gyp ERR! stack at Error (native)
gyp ERR! System Darwin 15.6.0
gyp ERR! command “/Users/ralphevano/.meteor/packages/meteor-tool/.1.4.0.hl4wt2++os.osx.x86_64+web.browser+web.cordova/mt-os.osx.x86_64/dev_bundle/bin/node”
”/Users/ralphevano/.meteor/packages/fourseven_scss/.3.8.0_1.18rqyk3++os.osx.x86_64+web.browser+web.cordova/plugin.compileScssBatch.os.osx.x86_64/npm/node_modules/meteor/compileScssBatch/node_modules/node-gyp/bin/node-gyp.js”
“rebuild” “–verbose” “–libsass_ext=” “–libsass_cflags=” “–libsass_ldflags=” "–libsass_library="
gyp ERR! cwd
/Users/ralphevano/.meteor/packages/fourseven_scss/.3.8.0_1.18rqyk3++os.osx.x86_64+web.browser+web.cordova/plugin.compileScssBatch.os.osx.x86_64/npm/node_modules/meteor/compileScssBatch/node_modules/.temp-on4ztm/node_modules/node-sass
gyp ERR! node -v v4.4.7
gyp ERR! node-gyp -v v3.3.1
gyp ERR! not ok
Build failed

npm ERR! Darwin 15.6.0
npm ERR! argv “/Users/ralphevano/.meteor/packages/meteor-tool/.1.4.0.hl4wt2++os.osx.x86_64+web.browser+web.cordova/mt-os.osx.x86_64/dev_bundle/bin/node”
"/Users/ralphevano/.meteor/packages/meteor-tool/.1.4.0.hl4wt2++os.osx.x86_64+web.browser+web.cordova/mt-os.osx.x86_64/dev_bundle/bin/npm" “rebuild” “–no-bin-links”
"–update-binary"
npm ERR! node v4.4.7
npm ERR! npm v3.10.5
npm ERR! code ELIFECYCLE
npm ERR! node-sass@3.8.0 postinstall: node scripts/build.js
npm ERR! Exit status 1
npm ERR!
npm ERR! Failed at the node-sass@3.8.0 postinstall script ‘node scripts/build.js’.
npm ERR! Make sure you have the latest version of node.js and npm installed.
npm ERR! If you do, this is most likely a problem with the node-sass package,
npm ERR! not with npm itself.
npm ERR! Tell the author that this fails on your system:
npm ERR! node scripts/build.js
npm ERR! You can get information on how to open an issue for this project with:
npm ERR! npm bugs node-sass
npm ERR! Or if that isn’t available, you can get their info via:
npm ERR! npm owner ls node-sass
npm ERR! There is likely additional logging output above.

npm ERR! Please include the following file with any support request:
npm ERR!
/Users/ralphevano/.meteor/packages/fourseven_scss/.3.8.0_1.18rqyk3++os.osx.x86_64+web.browser+web.cordova/plugin.compileScssBatch.os.osx.x86_64/npm/node_modules/meteor/compileScssBatch/node_modules/.temp-on4ztm/npm-debug.log

`


#2

Try clearing contents of versions file, meteor reset and try again. Worked for me.


#3

How should I do that please ?


#4

Hi David,

open your project folder in a new console or terminal, and execute the following commands:

mv .meteor/versions .meteor/old.versions
touch .meteor/versions
meteor reset
meteor update

Then your project can use the new version of meteor.

Hope this helps!


#5

I am getting the same error and clearing contents of version files did not resolve it.